BDBM50251158 2-[(3,4,5-Trimethoxy-phenyl)amino]-3-phenyl-5,7-diamino-quinoxaline::CHEMBL464504
SMILES COc1cc(Nc2nc3cc(N)cc(N)c3nc2-c2ccccc2)cc(OC)c1OC
InChI Key InChIKey=GICRJTKAQVGUGG-UHFFFAOYSA-N
Data  2 KI
  Tab Delimited (TSV)   2D SDfile   Computed 3D by Vconf -m prep SDfile
Find this compound or compounds like it in BindingDB:
Activity Spreadsheet -- Enzyme Inhibition Constant Data from BindingDB
Found 1 hit for monomerid = 50251158
TargetDihydrofolate reductase(Homo sapiens (Human))
Università
Curated by ChEMBL
LigandPNGBDBM50251158(2-[(3,4,5-Trimethoxy-phenyl)amino]-3-phenyl-5,7-di...)
Affinity DataKi:  100nM. Assay description: Inhibition of human dihydrofolate reductase
In DepthDetails ArticlePubMed